Target
WD repeat-containing protein 5
Ligand
BDBM468756
Substrate
Meas. Tech.
TR-FRET Binding Assay
Ki
0.200±n/a nM
Citation
 Gogliotti, RDStauffer, SRJeon, KSalovich, JMMacdonald, JDMills, JJMeyers, KMAlvarado, JRHan, CFesik, SWLee, T WDR5-MLL1 inhibitors and modulators US Patent  US10807959 Publication Date 10/20/2020 
Target
Name:
WD repeat-containing protein 5
Synonyms:
BIG3 WD repeat-containing protein 5 (WDR5) WDR5 | WDR5_HUMAN
Type:
Protein
Mol. Mass.:
36597.13
Organism:
Homo sapiens (Human)
Description:
P61964
Residue:
334
  
Inhibitor
Name:
BDBM468756
Synonyms:
US10807959, Example 25
Type:
Small organic molecule
Emp. Form.:
C27H30N6O
Mol. Mass.:
454.5667
SMILES:
Cc1ccnc(c1)C(NC(=O)c1cc(CNC2=NCCN2)cc(c1)-c1cnccc1C)C1CC1
: