Target
WD repeat-containing protein 5
Ligand
BDBM468797
Substrate
Meas. Tech.
TR-FRET Binding Assay
Ki
<0.100±n/a nM
Citation
 Gogliotti, RDStauffer, SRJeon, KSalovich, JMMacdonald, JDMills, JJMeyers, KMAlvarado, JRHan, CFesik, SWLee, T WDR5-MLL1 inhibitors and modulators US Patent  US10807959 Publication Date 10/20/2020 
Target
Name:
WD repeat-containing protein 5
Synonyms:
BIG3 WD repeat-containing protein 5 (WDR5) WDR5 | WDR5_HUMAN
Type:
Protein
Mol. Mass.:
36597.13
Organism:
Homo sapiens (Human)
Description:
P61964
Residue:
334
  
Inhibitor
Name:
BDBM468797
Synonyms:
US10807959, Example 67
Type:
Small organic molecule
Emp. Form.:
C26H24ClF3N4O
Mol. Mass.:
500.943
SMILES:
Cc1cc(CNC(=O)c2cc(CNC3=NCCC3)cc(c2)-c2cccnc2C(F)(F)F)ccc1Cl
: