Target
WD repeat-containing protein 5
Ligand
BDBM468835
Substrate
Meas. Tech.
TR-FRET Binding Assay
Ki
<0.100±n/a nM
Citation
 Gogliotti, RDStauffer, SRJeon, KSalovich, JMMacdonald, JDMills, JJMeyers, KMAlvarado, JRHan, CFesik, SWLee, T WDR5-MLL1 inhibitors and modulators US Patent  US10807959 Publication Date 10/20/2020 
Target
Name:
WD repeat-containing protein 5
Synonyms:
BIG3 WD repeat-containing protein 5 (WDR5) WDR5 | WDR5_HUMAN
Type:
Protein
Mol. Mass.:
36597.13
Organism:
Homo sapiens (Human)
Description:
P61964
Residue:
334
  
Inhibitor
Name:
BDBM468835
Synonyms:
US10807959, Example 105
Type:
Small organic molecule
Emp. Form.:
C29H31F4N5O
Mol. Mass.:
541.583
SMILES:
CCn1cc(c(n1)C(F)(F)F)-c1cc(CNC(=N)C2CC2)cc(c1)C(=O)N[C@@H](C1CC1)c1ccc(F)c(C)c1
: