Target
WD repeat-containing protein 5
Ligand
BDBM468929
Substrate
Meas. Tech.
FPA Binding Assay
Ki
0.118±n/a nM
Citation
 Gogliotti, RDStauffer, SRJeon, KSalovich, JMMacdonald, JDMills, JJMeyers, KMAlvarado, JRHan, CFesik, SWLee, T WDR5-MLL1 inhibitors and modulators US Patent  US10807959 Publication Date 10/20/2020 
Target
Name:
WD repeat-containing protein 5
Synonyms:
BIG3 WD repeat-containing protein 5 (WDR5) WDR5 | WDR5_HUMAN
Type:
Protein
Mol. Mass.:
36597.13
Organism:
Homo sapiens (Human)
Description:
P61964
Residue:
334
  
Inhibitor
Name:
BDBM468929
Synonyms:
US10807959, Example B84
Type:
Small organic molecule
Emp. Form.:
C25H26ClN5O
Mol. Mass.:
447.96
SMILES:
Cc1cc(ccn1)-c1cc(CNC2=NCCN2)cc(c1)C(=O)NCc1ccc(Cl)c(C)c1
: