Target
Rho-associated protein kinase 1
Ligand
BDBM468956
Substrate
Meas. Tech.
ROCK1 and ROCK2 Kinase Inhibition Assays
IC50
207±n/a nM
Citation
 Wang, TGately, S Heterocyclic compounds as kinase inhibitors US Patent  US10807966 Publication Date 10/20/2020 
Target
Name:
Rho-associated protein kinase 1
Synonyms:
ROCK-I ROCK1_HUMAN Rho-associated protein kinase Rho-associated, coiled-coil-containing protein kinase 1 Rho-kinase (ROCK I) p160 ROCK-1 | p160ROCK
Type:
Serine/threonine-protein kinase
Mol. Mass.:
158156.77
Organism:
Homo sapiens (Human)
Description:
Q13464
Residue:
1354
  
Inhibitor
Name:
BDBM468956
Synonyms:
US10807966, Compound 1
Type:
Small organic molecule
Emp. Form.:
C17H15FN4O2
Mol. Mass.:
326.325
SMILES:
OCC(NC(=O)c1cc([nH]n1)-c1ccncc1)c1cccc(F)c1
: