Target
Rho-associated protein kinase 1
Ligand
BDBM412127
Substrate
Meas. Tech.
ROCK1 and ROCK2 Kinase Inhibition Assays
IC50
73.0±n/a nM
Citation
 Wang, TGately, S Heterocyclic compounds as kinase inhibitors US Patent  US10807966 Publication Date 10/20/2020 
Target
Name:
Rho-associated protein kinase 1
Synonyms:
ROCK-I ROCK1_HUMAN Rho-associated protein kinase Rho-associated, coiled-coil-containing protein kinase 1 Rho-kinase (ROCK I) p160 ROCK-1 | p160ROCK
Type:
Serine/threonine-protein kinase
Mol. Mass.:
158156.77
Organism:
Homo sapiens (Human)
Description:
Q13464
Residue:
1354
  
Inhibitor
Name:
BDBM412127
Synonyms:
US10392402, Compound ID 5 | US10807966, Compound 25
Type:
Small organic molecule
Emp. Form.:
C17H17N5O2
Mol. Mass.:
323.3492
SMILES:
COc1cccc(CNC(=O)Nc2cc([nH]n2)-c2ccncc2)c1
: