Target
Rho-associated protein kinase 2
Ligand
BDBM468967
Substrate
IC50
7.10±n/a nM
Citation
 Wang, TGately, S Heterocyclic compounds as kinase inhibitors US Patent  US10807966 Publication Date 10/20/2020 
Target
Name:
Rho-associated protein kinase 2
Synonyms:
KIAA0619 ROCK2 Rho kinase 2 (ROCKII) Rho-associated protein kinase 2 (ROCK2) Rho-associated protein kinase 2/Transforming protein RhoA Rho-associated, coiled-coil-containing protein kinase II p164 ROCK-2
Type:
Protein
Mol. Mass.:
160885.43
Organism:
Homo sapiens (Human)
Description:
O75116
Residue:
1388
  
Inhibitor
Name:
BDBM468967
Synonyms:
US10807966, Compound 61
Type:
Small organic molecule
Emp. Form.:
C20H18N4O3S
Mol. Mass.:
394.447
SMILES:
COc1cccc(c1)[C@@H](CO)NC(=O)c1cc2ccc(nc2s1)-c1cn[nH]c1
: