Target
Rho-associated protein kinase 1
Ligand
BDBM412136
Substrate
Meas. Tech.
ROCK1 and ROCK2 Kinase Inhibition Assays
IC50
3.30±n/a nM
Citation
 Wang, TGately, S Heterocyclic compounds as kinase inhibitors US Patent  US10807966 Publication Date 10/20/2020 
Target
Name:
Rho-associated protein kinase 1
Synonyms:
ROCK-I ROCK1_HUMAN Rho-associated protein kinase Rho-associated, coiled-coil-containing protein kinase 1 Rho-kinase (ROCK I) p160 ROCK-1 | p160ROCK
Type:
Serine/threonine-protein kinase
Mol. Mass.:
158156.77
Organism:
Homo sapiens (Human)
Description:
Q13464
Residue:
1354
  
Inhibitor
Name:
BDBM412136
Synonyms:
US10392402, Compound A US10807966, Compound A | US11555039, Compound ID A
Type:
Small organic molecule
Emp. Form.:
C18H13ClF2N6O
Mol. Mass.:
402.785
SMILES:
Cc1c[nH]c2nccc(Oc3c(F)cc(Nc4cc(Cl)nc(N)n4)cc3F)c12
: