Target
Dipeptidyl peptidase 4
Ligand
BDBM468975
Substrate
Meas. Tech.
Enzymatic Activity Assay of DPP-4
IC50
<1.52±n/a nM
Citation
 Ho, KKQuan, WZhou, J Pyrrolidinone compounds US Patent  US10807971 Publication Date 10/20/2020 
Target
Name:
Dipeptidyl peptidase 4
Synonyms:
ADABP Adenosine deaminase complexing protein 2 CD_antigen=CD26 DPP4 DPPIV Dipeptidyl peptidase 4 (DPP IV) Dipeptidyl peptidase 4 (DPP4) Dipeptidyl peptidase 4 membrane form Dipeptidyl peptidase IV Dipeptidyl peptidase IV (DDP-IV) Dipeptidyl peptidase IV membrane form Dipeptidyl peptidase-IV (DPP-4) T-cell activation antigen CD26 | TP103
Type:
Enzyme
Mol. Mass.:
88271.01
Organism:
Homo sapiens (Human)
Description:
P27487
Residue:
766
  
Inhibitor
Name:
BDBM468975
Synonyms:
1-[2-[(3R,5S,6R)-5-Amino-6- (2,5- difluorophenyl)tetrahydropyran- 3-yl]triazol-4-yl]-N-[(3,5- dichloro-2-fluoro- phenyl)methyl]-3-hydroxy-2- oxo-pyrrolidine-3- carboxamide, isomer 1 hydrochloride | US10807971, Example 11
Type:
Small organic molecule
Emp. Form.:
C25H23Cl2F3N6O4
Mol. Mass.:
599.389
SMILES:
N[C@H]1C[C@H](CO[C@@H]1c1cc(F)ccc1F)n1ncc(n1)N1CCC(O)(C(=O)NCc2cc(Cl)cc(Cl)c2F)C1=O
: