Target
Dipeptidyl peptidase 4
Ligand
BDBM468978
Substrate
Meas. Tech.
Enzymatic Activity Assay of DPP-4
IC50
13.1±n/a nM
Citation
 Ho, KKQuan, WZhou, J Pyrrolidinone compounds US Patent  US10807971 Publication Date 10/20/2020 
Target
Name:
Dipeptidyl peptidase 4
Synonyms:
Cd26 Dipeptidyl peptidase IV | Dpp4
Type:
PROTEIN
Mol. Mass.:
87433.73
Organism:
Mus musculus
Description:
ChEMBL_1335112
Residue:
760
  
Inhibitor
Name:
BDBM468978
Synonyms:
1-[1-[(3R,5S,6R)-5-Amino-6- (2,5- difluorophenyl)tetrahydropyran- 3-yl]pyrazol-3-yl]-3- hydroxy-2-oxo-N-[(2,3,5- trifluorophenyl)methyl]pyrrol- idine-3-carboxamide, isomer 1 hydrochloride | US10807971, Example 14
Type:
Small organic molecule
Emp. Form.:
C26H24F5N5O4
Mol. Mass.:
565.4919
SMILES:
N[C@H]1C[C@H](CO[C@@H]1c1cc(F)ccc1F)n1ccc(n1)N1CCC(O)(C(=O)NCc2cc(F)cc(F)c2F)C1=O
: