Target
Protein-lysine 6-oxidase
Ligand
BDBM50526737
Substrate
Meas. Tech.
LOX Activity in Cysts Assay
IC50
<180±n/a nM
Citation
 Springer, CMarais, RNiculescu-Duvaz, DLeung, LSmithen, DCallens, CTang, H Methylamine derivatives as lysysl oxidase inhibitors for the treatment of cancer US Patent  US10807974 Publication Date 10/20/2020 
Target
Name:
Protein-lysine 6-oxidase
Synonyms:
1.4.3.13 Lox Protein-lysine 6-oxidase Protein-lysine 6-oxidase, short form Rrg
Type:
PROTEIN
Mol. Mass.:
46713.95
Organism:
Mus musculus
Description:
ChEMBL_118959
Residue:
411
  
Inhibitor
Name:
BDBM50526737
Synonyms:
CHEMBL4528500 US10995088, Example 82 | US11608330, Example 82
Type:
Small organic molecule
Emp. Form.:
C19H19NO4S3
Mol. Mass.:
421.553
SMILES:
Cc1ccc(cc1)-c1cc(ccc1S(C)(=O)=O)S(=O)(=O)c1ccc(CN)s1
: