Target
Lysyl oxidase homolog 2
Ligand
BDBM50526748
Substrate
Meas. Tech.
LOXL2 Enzyme Activity Assay (c)
IC50
90.0±n/a nM
Citation
 Springer, CMarais, RNiculescu-Duvaz, DLeung, LSmithen, DCallens, CTang, H Methylamine derivatives as lysysl oxidase inhibitors for the treatment of cancer US Patent  US10807974 Publication Date 10/20/2020 
Target
Name:
Lysyl oxidase homolog 2
Synonyms:
1.4.3.13 LOXL2_HUMAN Lysyl oxidase-like protein 2 Lysyl oxidase-related protein WS9-14
Type:
PROTEIN
Mol. Mass.:
86721.38
Organism:
Homo sapiens (Human)
Description:
ChEMBL_115990
Residue:
774
  
Inhibitor
Name:
BDBM50526748
Synonyms:
CHEMBL4443558 US10995088, Example 24 | US11608330, Example 24
Type:
Small organic molecule
Emp. Form.:
C15H13NO2S2
Mol. Mass.:
303.399
SMILES:
NCc1ccc(s1)S(=O)(=O)c1ccc2ccccc2c1
: