Target
Lysyl oxidase homolog 2
Ligand
BDBM469096
Substrate
Meas. Tech.
LOXL2 Enzyme Activity Assay (c)
IC50
140±n/a nM
Citation
 Springer, CMarais, RNiculescu-Duvaz, DLeung, LSmithen, DCallens, CTang, H Methylamine derivatives as lysysl oxidase inhibitors for the treatment of cancer US Patent  US10807974 Publication Date 10/20/2020 
Target
Name:
Lysyl oxidase homolog 2
Synonyms:
1.4.3.13 LOXL2_HUMAN Lysyl oxidase-like protein 2 Lysyl oxidase-related protein WS9-14
Type:
PROTEIN
Mol. Mass.:
86721.38
Organism:
Homo sapiens (Human)
Description:
ChEMBL_115990
Residue:
774
  
Inhibitor
Name:
BDBM469096
Synonyms:
US10807974, Example 115 US11608330, Example 115
Type:
Small organic molecule
Emp. Form.:
C16H16N2O2S3
Mol. Mass.:
364.505
SMILES:
CCc1cc(cc(c1)S(=O)(=O)c1cnc(CN)s1)-c1ccsc1
: