Target
Lysyl oxidase homolog 2
Ligand
BDBM469109
Substrate
Meas. Tech.
LOXL2 Enzyme Activity Assay (b)
IC50
82.0±n/a nM
Citation
 Springer, CMarais, RNiculescu-Duvaz, DLeung, LSmithen, DCallens, CTang, H Methylamine derivatives as lysysl oxidase inhibitors for the treatment of cancer US Patent  US10807974 Publication Date 10/20/2020 
Target
Name:
Lysyl oxidase homolog 2
Synonyms:
1.4.3.13 LOXL2_HUMAN Lysyl oxidase-like protein 2 Lysyl oxidase-related protein WS9-14
Type:
PROTEIN
Mol. Mass.:
86721.38
Organism:
Homo sapiens (Human)
Description:
ChEMBL_115990
Residue:
774
  
Inhibitor
Name:
BDBM469109
Synonyms:
US10807974, Example 128 US11608330, Example 128
Type:
Small organic molecule
Emp. Form.:
C15H16N4O3S2
Mol. Mass.:
364.443
SMILES:
COc1cc(cc(c1)S(=O)(=O)c1cnc(CN)s1)-c1cnn(C)c1
: