Target
Lysyl oxidase homolog 2
Ligand
BDBM50526732
Substrate
Meas. Tech.
LOXL2 Enzyme Activity Assay (b)
IC50
85.0±n/a nM
Citation
 Springer, CMarais, RNiculescu-Duvaz, DLeung, LSmithen, DCallens, CTang, H Methylamine derivatives as lysysl oxidase inhibitors for the treatment of cancer US Patent  US10807974 Publication Date 10/20/2020 
Target
Name:
Lysyl oxidase homolog 2
Synonyms:
1.4.3.13 LOXL2_HUMAN Lysyl oxidase-like protein 2 Lysyl oxidase-related protein WS9-14
Type:
PROTEIN
Mol. Mass.:
86721.38
Organism:
Homo sapiens (Human)
Description:
ChEMBL_115990
Residue:
774
  
Inhibitor
Name:
BDBM50526732
Synonyms:
CHEMBL4460845 US10995088, Example 131 | US11608330, Example 131
Type:
Small organic molecule
Emp. Form.:
C14H13FN4O2S2
Mol. Mass.:
352.407
SMILES:
Cn1cc(cn1)-c1cc(F)cc(c1)S(=O)(=O)c1cnc(CN)s1
: