Target
Lysyl oxidase homolog 2
Ligand
BDBM469122
Substrate
Meas. Tech.
LOXL2 Enzyme Activity Assay (b)
IC50
72.0±n/a nM
Citation
 Springer, CMarais, RNiculescu-Duvaz, DLeung, LSmithen, DCallens, CTang, H Methylamine derivatives as lysysl oxidase inhibitors for the treatment of cancer US Patent  US10807974 Publication Date 10/20/2020 
Target
Name:
Lysyl oxidase homolog 2
Synonyms:
1.4.3.13 LOXL2_HUMAN Lysyl oxidase-like protein 2 Lysyl oxidase-related protein WS9-14
Type:
PROTEIN
Mol. Mass.:
86721.38
Organism:
Homo sapiens (Human)
Description:
ChEMBL_115990
Residue:
774
  
Inhibitor
Name:
BDBM469122
Synonyms:
(5-((3-Methoxy-5-(1-(methoxymethyl)-1H-pyrazol-4-yl)phenyl)sulfonyl)thiazol-2-yl)methanamine tri-trifluoroacetate and US10995088, Example 141 | US11608330, Example 141
Type:
Small organic molecule
Emp. Form.:
C16H18N4O4S2
Mol. Mass.:
394.469
SMILES:
COCn1cc(cn1)-c1cc(OC)cc(c1)S(=O)(=O)c1cnc(CN)s1
: