Target
Bromodomain-containing protein 4
Ligand
BDBM469053
Substrate
Meas. Tech.
In Vitro Enzyme Inhibition Assay
IC50
<500±n/a nM
Citation
 Bennett, MJBetancort, JMBoloor, AKaldor, SWStafford, JAVeal, JM Bromodomain inhibitors US Patent  US10807982 Publication Date 10/20/2020 
Target
Name:
Bromodomain-containing protein 4
Synonyms:
BRD4 Bromodomain-containing protein 4 (BRD4) Protein HUNK1
Type:
Protein
Mol. Mass.:
152264.84
Organism:
Homo sapiens (Human)
Description:
O60885
Residue:
1362
  
Inhibitor
Name:
BDBM469053
Synonyms:
4-(5-methoxy-2-methyl-1,1-dioxo-3H-1,2- benzothiazol-6-yl)-2-methylisoquinolin-1-one | US10807982, Example 4
Type:
Small organic molecule
Emp. Form.:
C19H18N2O4S
Mol. Mass.:
370.422
SMILES:
COc1cc2CN(C)S(=O)(=O)c2cc1-c1cn(C)c(=O)c2ccccc12
: