Target
Bromodomain-containing protein 4
Ligand
BDBM469090
Substrate
Meas. Tech.
In Vitro Enzyme Inhibition Assay
IC50
<500±n/a nM
Citation
 Bennett, MJBetancort, JMBoloor, AKaldor, SWStafford, JAVeal, JM Bromodomain inhibitors US Patent  US10807982 Publication Date 10/20/2020 
Target
Name:
Bromodomain-containing protein 4
Synonyms:
BRD4 Bromodomain-containing protein 4 (BRD4) Protein HUNK1
Type:
Protein
Mol. Mass.:
152264.84
Organism:
Homo sapiens (Human)
Description:
O60885
Residue:
1362
  
Inhibitor
Name:
BDBM469090
Synonyms:
5-[5-(2,4-difluorophenoxy)-2-methyl-1,1-dioxo- 3H-1,2-benzothiazol-6-yl-1-methylpyridin-2-one | US10807982, Example 12
Type:
Small organic molecule
Emp. Form.:
C20H16F2N2O4S
Mol. Mass.:
418.414
SMILES:
CN1Cc2cc(Oc3ccc(F)cc3F)c(cc2S1(=O)=O)-c1ccc(=O)n(C)c1
: