Target
Bromodomain-containing protein 4
Ligand
BDBM469164
Substrate
Meas. Tech.
In Vitro Enzyme Inhibition Assay
IC50
<500±n/a nM
Citation
 Bennett, MJBetancort, JMBoloor, AKaldor, SWStafford, JAVeal, JM Bromodomain inhibitors US Patent  US10807982 Publication Date 10/20/2020 
Target
Name:
Bromodomain-containing protein 4
Synonyms:
BRD4 Bromodomain-containing protein 4 (BRD4) Protein HUNK1
Type:
Protein
Mol. Mass.:
152264.84
Organism:
Homo sapiens (Human)
Description:
O60885
Residue:
1362
  
Inhibitor
Name:
BDBM469164
Synonyms:
Step 1: 6-bromo-2-methyl-4-nitro-1-(1-phenylethyl)benzimidazole US10807982, Example 45
Type:
Small organic molecule
Emp. Form.:
C24H26N4O3S
Mol. Mass.:
450.553
SMILES:
CC(c1ccccc1)n1c(C)nc2c(NS(C)(=O)=O)cc(cc12)-c1cc(C)c(=O)n(C)c1
: