Target
Bromodomain-containing protein 4
Ligand
BDBM469179
Substrate
Meas. Tech.
In Vitro Enzyme Inhibition Assay
IC50
<500±n/a nM
Citation
 Bennett, MJBetancort, JMBoloor, AKaldor, SWStafford, JAVeal, JM Bromodomain inhibitors US Patent  US10807982 Publication Date 10/20/2020 
Target
Name:
Bromodomain-containing protein 4
Synonyms:
BRD4 Bromodomain-containing protein 4 (BRD4) Protein HUNK1
Type:
Protein
Mol. Mass.:
152264.84
Organism:
Homo sapiens (Human)
Description:
O60885
Residue:
1362
  
Inhibitor
Name:
BDBM469179
Synonyms:
5-[6-(cyclopropylmethoxy)-1-methyl-3- methylsulfonylindazol-5-yl]-3-methoxy-1- methylpyridin-2-one | US10807982, Example 59
Type:
Small organic molecule
Emp. Form.:
C19H23N3O5S2
Mol. Mass.:
437.533
SMILES:
COc1cc(cn(C)c1=O)-c1cc2c(cc1OCC1CC1)N(C)N=S2S(C)(=O)=O
: