Target
Bromodomain-containing protein 4
Ligand
BDBM469189
Substrate
Meas. Tech.
In Vitro Enzyme Inhibition Assay
IC50
<500±n/a nM
Citation
 Bennett, MJBetancort, JMBoloor, AKaldor, SWStafford, JAVeal, JM Bromodomain inhibitors US Patent  US10807982 Publication Date 10/20/2020 
Target
Name:
Bromodomain-containing protein 4
Synonyms:
BRD4 Bromodomain-containing protein 4 (BRD4) Protein HUNK1
Type:
Protein
Mol. Mass.:
152264.84
Organism:
Homo sapiens (Human)
Description:
O60885
Residue:
1362
  
Inhibitor
Name:
BDBM469189
Synonyms:
5-[3-(cyclopropylmethyl)-7-ethylsulfonyl-2- methylbenzimidazol-5-yl]-1,3- dimethylpyridin-2-one | US10807982, Example 69
Type:
Small organic molecule
Emp. Form.:
C21H25N3O3S
Mol. Mass.:
399.507
SMILES:
CCS(=O)(=O)c1cc(cc2n(CC3CC3)c(C)nc12)-c1cc(C)c(=O)n(C)c1
: