Target
Mast/stem cell growth factor receptor Kit [D816V]
Ligand
BDBM469234
Substrate
Meas. Tech.
KIT D816V assay at Km
IC50
5.5±n/a nM
Citation
 Wilson, KJ Compositions useful for treating disorders related to kit US Patent  US10807985 Publication Date 10/20/2020 
Target
Name:
Mast/stem cell growth factor receptor Kit [D816V]
Synonyms:
KIT Mast/stem cell growth factor receptor Kit (D816V) SCFR | Tyrosine-protein kinase Kit (Kit)(D816V)
Type:
Protein
Mol. Mass.:
109854.42
Organism:
Homo sapiens (Human)
Description:
Human Kit D816V mutant
Residue:
976
  
Inhibitor
Name:
BDBM469234
Synonyms:
US10807985, Compound 9
Type:
Small organic molecule
Emp. Form.:
C26H27N9
Mol. Mass.:
465.5529
SMILES:
C[C@H](c1ccccc1)c1cnc(nc1)N1CCN(CC1)c1ncnn2cc(cc12)-c1cnn(C)c1
: