Target
Mast/stem cell growth factor receptor Kit [D816V]
Ligand
BDBM469239
Substrate
Meas. Tech.
KIT D816V assay at Km
IC50
<1.0±n/a nM
Citation
 Wilson, KJ Compositions useful for treating disorders related to kit US Patent  US10807985 Publication Date 10/20/2020 
Target
Name:
Mast/stem cell growth factor receptor Kit [D816V]
Synonyms:
KIT Mast/stem cell growth factor receptor Kit (D816V) SCFR | Tyrosine-protein kinase Kit (Kit)(D816V)
Type:
Protein
Mol. Mass.:
109854.42
Organism:
Homo sapiens (Human)
Description:
Human Kit D816V mutant
Residue:
976
  
Inhibitor
Name:
BDBM469239
Synonyms:
US10807985, Compound 14
Type:
Small organic molecule
Emp. Form.:
C25H24FN9
Mol. Mass.:
469.5168
SMILES:
Cn1cc(cn1)-c1cc2c(ncnn2c1)N1CCN(CC1)c1ncc(Cc2ccc(F)cc2)cn1
: