Target
Platelet-derived growth factor receptor alpha [D842V]
Ligand
BDBM469266
Substrate
Meas. Tech.
PDGFRA D842V assay at Km
IC50
5.5±n/a nM
Citation
 Wilson, KJ Compositions useful for treating disorders related to kit US Patent  US10807985 Publication Date 10/20/2020 
Target
Name:
Platelet-derived growth factor receptor alpha [D842V]
Synonyms:
PDGFR2 PGFRA_HUMAN Platelet-derived growth factor receptor alpha (PDGFR)(D842V) RHEPDGFRA
Type:
Protein
Mol. Mass.:
122618.43
Organism:
Homo sapiens (Human)
Description:
P16234 (D842V)
Residue:
1089
  
Inhibitor
Name:
BDBM469266
Synonyms:
US10807985, Compound 41
Type:
Small organic molecule
Emp. Form.:
C27H28FN9
Mol. Mass.:
497.5699
SMILES:
CC[C@@H](c1ccc(F)cc1)c1cnc(nc1)N1CCN(CC1)c1ncnn2cc(cc12)-c1cnn(C)c1
: