Target
Platelet-derived growth factor receptor alpha [D842V]
Ligand
BDBM469336
Substrate
Meas. Tech.
PDGFRA D842V assay at Km
IC50
<1.0±n/a nM
Citation
 Wilson, KJ Compositions useful for treating disorders related to kit US Patent  US10807985 Publication Date 10/20/2020 
Target
Name:
Platelet-derived growth factor receptor alpha [D842V]
Synonyms:
PDGFR2 PGFRA_HUMAN Platelet-derived growth factor receptor alpha (PDGFR)(D842V) RHEPDGFRA
Type:
Protein
Mol. Mass.:
122618.43
Organism:
Homo sapiens (Human)
Description:
P16234 (D842V)
Residue:
1089
  
Inhibitor
Name:
BDBM469336
Synonyms:
US10807985, Compound 111
Type:
Small organic molecule
Emp. Form.:
C26H25F3N10
Mol. Mass.:
534.5389
SMILES:
Cn1cc(cn1)-c1cc2c(ncnn2c1)N1CCN(CC1)c1ncc(cn1)[C@](N)(C(F)F)c1ccc(F)cc1
: