Target
Mast/stem cell growth factor receptor Kit [D816V]
Ligand
BDBM469340
Substrate
Meas. Tech.
KIT D816V assay at Km
IC50
5.5±n/a nM
Citation
 Wilson, KJ Compositions useful for treating disorders related to kit US Patent  US10807985 Publication Date 10/20/2020 
Target
Name:
Mast/stem cell growth factor receptor Kit [D816V]
Synonyms:
KIT Mast/stem cell growth factor receptor Kit (D816V) SCFR | Tyrosine-protein kinase Kit (Kit)(D816V)
Type:
Protein
Mol. Mass.:
109854.42
Organism:
Homo sapiens (Human)
Description:
Human Kit D816V mutant
Residue:
976
  
Inhibitor
Name:
BDBM469340
Synonyms:
US10807985, Compound 115
Type:
Small organic molecule
Emp. Form.:
C26H24F3N9O
Mol. Mass.:
535.5237
SMILES:
Cn1cc(cn1)-c1cc2c(ncnn2c1)N1CCN(CC1)c1ncc(cn1)[C@](C)(O)c1c(F)cc(F)cc1F
: