Target
Proto-oncogene tyrosine-protein kinase receptor Ret
Ligand
BDBM311705
Substrate
Meas. Tech.
Measurement of Inhibitory Activity Against RET (In Vitro)
IC50
0.100±n/a nM
Citation
 Miyazaki, IShimamura, TKato, MFujita, HIguchi, S Fused pyrimidine compound or salt thereof US Patent  US10807986 Publication Date 10/20/2020 
Target
Name:
Proto-oncogene tyrosine-protein kinase receptor Ret
Synonyms:
CDHF12 Cadherin family member 12 Proto-oncogene c-Ret RET51 Tyrosine-protein kinase Ret (RET)
Type:
Protein
Mol. Mass.:
124318.29
Organism:
Homo sapiens (Human)
Description:
P07949
Residue:
1114
  
Inhibitor
Name:
BDBM311705
Synonyms:
Ex. Cpd. 157 US11046696, Compound 157
Type:
Small organic molecule
Emp. Form.:
C25H29N5O3
Mol. Mass.:
447.5295
SMILES:
CCC(O)CC#Cc1c(C(=O)Nc2ccc(COC)cc2)c2c(N)ncnc2n1C1(C)CC1
: