Target
Nociceptin receptor
Ligand
BDBM469820
Substrate
Meas. Tech.
Human Nociceptin/Orphanin FQ Peptide (hNOP) Receptor Binding Assay
Ki
1.000±n/a nM
Citation
 Kuehnert, SKoenigs, RMJakob, FKless, ARatcliffe, PJostock, RKoch, TLinz, KSchroeder, WSchiene, KWegert, A 3-(carboxymethyl)-8-amino-2-oxo-1,3-diaza-spiro-[4.5]-decane derivatives US Patent  US10807989 Publication Date 10/20/2020 
Target
Name:
Nociceptin receptor
Synonyms:
KOR-3 Mu-type opioid receptor (Mu) Nociceptin Receptor (ORL1 Receptor) Nociceptin receptor (ORL-1) Nociceptin/Orphanin FQ, NOP receptor OPIATE ORL-1 OPRL1 protein ORL1 Opioid receptor like-1 Orphanin FQ receptor (ORL1) | P41146
Type:
G Protein-Coupled Receptor (GPCR)
Mol. Mass.:
40702.87
Organism:
Homo sapiens (Human)
Description:
P41146
Residue:
370
  
Inhibitor
Name:
BDBM469820
Synonyms:
CIS-2-[1-(Cyclobutyl-methyl)-8-dimethylamino-2-oxo-8-phenyl-1,3- diazaspiro[4.5]decan-3-yl]-N-(3-methoxy-pyridin-4-yl)-acetamide | US10807989, Example SC_1048
Type:
Small organic molecule
Emp. Form.:
C29H39N5O3
Mol. Mass.:
505.6517
SMILES:
COc1cnccc1NC(=O)CN1C[C@]2(CC[C@@](CC2)(N(C)C)c2ccccc2)N(CC2CCC2)C1=O
: