Target
Sphingosine 1-phosphate receptor 3
Ligand
BDBM321328
Substrate
Meas. Tech.
In Vitro Functional Activity (Agonism) on Human S1P3 Receptors
EC50
>10000±n/a nM
Citation
 Stoit, AIwema Bakker, WICoolen, HKvan Dongen, MJLeflemme, NJHobson, A Spiro-cyclic amine derivatives as S1P modulators US Patent  US10807991 Publication Date 10/20/2020 
Target
Name:
Sphingosine 1-phosphate receptor 3
Synonyms:
C9orf108 EDG3 S1P receptor 3 S1P3 S1PR3_HUMAN Sphingosine 1-phosphate receptor 3 (S1P3) | Sphingosine 1-phosphate receptor Edg-3
Type:
G Protein-Coupled Receptor (GPCR)
Mol. Mass.:
42278.13
Organism:
Homo sapiens (Human)
Description:
Q99500
Residue:
378
  
Inhibitor
Name:
BDBM321328
Synonyms:
US10179791, Compound 253 | US10807991, Compound 253
Type:
Small organic molecule
Emp. Form.:
C25H28FNO4
Mol. Mass.:
425.4925
SMILES:
OC(=O)CCN1CCC2(COc3cc(OCc4c(F)cccc4C4CC4)ccc23)CC1
: