Target
Sphingosine 1-phosphate receptor 5
Ligand
BDBM321338
Substrate
Meas. Tech.
In Vitro Functional Activity (Agonism) on Human S1P5 Receptors
EC50
79.4±n/a nM
Citation
 Stoit, AIwema Bakker, WICoolen, HKvan Dongen, MJLeflemme, NJHobson, A Spiro-cyclic amine derivatives as S1P modulators US Patent  US10807991 Publication Date 10/20/2020 
Target
Name:
Sphingosine 1-phosphate receptor 5
Synonyms:
EDG8 S1P5 S1PR5_HUMAN Sphingosine 1-phosphate receptor Edg-8
Type:
G Protein-Coupled Receptor (GPCR)
Mol. Mass.:
41796.42
Organism:
Homo sapiens (Human)
Description:
Residue:
398
  
Inhibitor
Name:
BDBM321338
Synonyms:
US10179791, Compound 321 | US10807991, Compound 321
Type:
Small organic molecule
Emp. Form.:
C22H23Cl2NO4
Mol. Mass.:
436.328
SMILES:
OC(=O)CCN1CCCC2(COc3cc(OCc4c(Cl)cccc4Cl)ccc23)C1
: