Target
Potassium voltage-gated channel subfamily H member 2
Ligand
BDBM470121
Substrate
Meas. Tech.
Test for Evaluating hERG Inhibition
IC50
6300±n/a nM
Citation
 Ban, HKamioka, SSawayama, YHashizume, M Dihydrochromene derivatives US Patent  US10807993 Publication Date 10/20/2020 
Target
Name:
Potassium voltage-gated channel subfamily H member 2
Synonyms:
1,3-beta-glucan synthase component GLS2 ERG Eag-related protein 1 Ether-a-go-go-related gene (HERG) Ether-a-go-go-related gene potassium channel 1 Ether-a-go-go-related gene potassium channel 1 (hERG1) Ether-a-go-go-related protein 1 H-ERG KCNH2 Potassium voltage-gated channel subfamily H member 2 (hERG) Voltage-gated potassium channel subunit Kv11.1 hERG Potassium Channel 1 | putative potassium channel subunit
Type:
Multi-pass membrane protein
Mol. Mass.:
126672.65
Organism:
Homo sapiens (Human)
Description:
Q12809
Residue:
1159
  
Inhibitor
Name:
BDBM470121
Synonyms:
US10807993, Example 62
Type:
Small organic molecule
Emp. Form.:
C25H35ClN4O2
Mol. Mass.:
459.024
SMILES:
CC1(C)Oc2cc(Cl)ccc2C2OCC3(CCN(CCn4ccnc4CCN)CC3)CC12
: