Target
Wee1-like protein kinase
Ligand
BDBM470138
Substrate
Meas. Tech.
WEE1 IC50 Determination
IC50
173±n/a nM
Citation
 Chakravarty, SPham, SMKankanala, JAgarwal, AKPujala, BSoni, SArya, SKPalve, DKumar, V Heterocyclic compounds and uses thereof US Patent  US10807994 Publication Date 10/20/2020 
Target
Name:
Wee1-like protein kinase
Synonyms:
Serine/threonine-protein kinase WEE1 WEE1 homolog (S. pombe) | WEE1_HUMAN
Type:
PROTEIN
Mol. Mass.:
71599.12
Organism:
Homo sapiens (Human)
Description:
ChEMBL_1445054
Residue:
646
  
Inhibitor
Name:
BDBM470138
Synonyms:
US10807994, Compound 1.14 | US10807994, Example S-14
Type:
Small organic molecule
Emp. Form.:
C23H21ClFN5O2
Mol. Mass.:
453.897
SMILES:
CC1(C)CNCc2cc(Nc3ncc4C(=O)N(COc4n3)c3ccc(F)cc3Cl)ccc12
: