Target
Wee1-like protein kinase
Ligand
BDBM470154
Substrate
Meas. Tech.
WEE1 IC50 Determination
IC50
325±n/a nM
Citation
 Chakravarty, SPham, SMKankanala, JAgarwal, AKPujala, BSoni, SArya, SKPalve, DKumar, V Heterocyclic compounds and uses thereof US Patent  US10807994 Publication Date 10/20/2020 
Target
Name:
Wee1-like protein kinase
Synonyms:
Serine/threonine-protein kinase WEE1 WEE1 homolog (S. pombe) | WEE1_HUMAN
Type:
PROTEIN
Mol. Mass.:
71599.12
Organism:
Homo sapiens (Human)
Description:
ChEMBL_1445054
Residue:
646
  
Inhibitor
Name:
BDBM470154
Synonyms:
US10807994, Compound 1.30 | US10807994, Example S-30
Type:
Small organic molecule
Emp. Form.:
C23H23ClN6O2
Mol. Mass.:
450.921
SMILES:
Cc1cccc(Cl)c1N1COc2nc(Nc3ccc(cc3)N3CCNCC3)ncc2C1=O
: