Target
Wee1-like protein kinase
Ligand
BDBM470167
Substrate
Meas. Tech.
WEE1 IC50 Determination
IC50
479±n/a nM
Citation
 Chakravarty, SPham, SMKankanala, JAgarwal, AKPujala, BSoni, SArya, SKPalve, DKumar, V Heterocyclic compounds and uses thereof US Patent  US10807994 Publication Date 10/20/2020 
Target
Name:
Wee1-like protein kinase
Synonyms:
Serine/threonine-protein kinase WEE1 WEE1 homolog (S. pombe) | WEE1_HUMAN
Type:
PROTEIN
Mol. Mass.:
71599.12
Organism:
Homo sapiens (Human)
Description:
ChEMBL_1445054
Residue:
646
  
Inhibitor
Name:
BDBM470167
Synonyms:
US10807994, Compound 1.43 | US10807994, Example S-43
Type:
Small organic molecule
Emp. Form.:
C22H21Cl2N7O2
Mol. Mass.:
486.354
SMILES:
CN1CCN(CC1)c1ccc(Nc2ncc3C(=O)N(COc3n2)c2c(Cl)cncc2Cl)cc1
: