Target
Wee1-like protein kinase
Ligand
BDBM470205
Substrate
Meas. Tech.
WEE1 IC50 Determination
IC50
185±n/a nM
Citation
 Chakravarty, SPham, SMKankanala, JAgarwal, AKPujala, BSoni, SArya, SKPalve, DKumar, V Heterocyclic compounds and uses thereof US Patent  US10807994 Publication Date 10/20/2020 
Target
Name:
Wee1-like protein kinase
Synonyms:
Serine/threonine-protein kinase WEE1 WEE1 homolog (S. pombe) | WEE1_HUMAN
Type:
PROTEIN
Mol. Mass.:
71599.12
Organism:
Homo sapiens (Human)
Description:
ChEMBL_1445054
Residue:
646
  
Inhibitor
Name:
BDBM470205
Synonyms:
US10807994, Compound 1.229 | US10807994, Example S-81
Type:
Small organic molecule
Emp. Form.:
C23H21Cl3N6O2
Mol. Mass.:
519.811
SMILES:
C[C@H]1CN(CCN1)c1ccc(Nc2ncc3C(=O)N(COc3n2)c2c(Cl)cccc2Cl)cc1Cl
: