Target
Wee1-like protein kinase
Ligand
BDBM470210
Substrate
Meas. Tech.
WEE1 IC50 Determination
IC50
202±n/a nM
Citation
 Chakravarty, SPham, SMKankanala, JAgarwal, AKPujala, BSoni, SArya, SKPalve, DKumar, V Heterocyclic compounds and uses thereof US Patent  US10807994 Publication Date 10/20/2020 
Target
Name:
Wee1-like protein kinase
Synonyms:
Serine/threonine-protein kinase WEE1 WEE1 homolog (S. pombe) | WEE1_HUMAN
Type:
PROTEIN
Mol. Mass.:
71599.12
Organism:
Homo sapiens (Human)
Description:
ChEMBL_1445054
Residue:
646
  
Inhibitor
Name:
BDBM470210
Synonyms:
US10807994, Compound 1.234 | US10807994, Example S-86
Type:
Small organic molecule
Emp. Form.:
C21H17Cl2N5OS
Mol. Mass.:
458.364
SMILES:
Clc1cccc(Cl)c1N1CSc2nc(Nc3ccc4CNCCc4c3)ncc2C1=O
: