Target
Fibroblast growth factor receptor 3
Ligand
BDBM356522
Substrate
Meas. Tech.
Enzymatic Assay
IC50
<10±n/a nM
Citation
 Yao, WZhang, CXu, MZhuo, JHe, C Substituted imidazopyridazines and benzimidazoles as inhibitors of FGFR3 US Patent  US10813930 Publication Date 10/27/2020 
Target
Name:
Fibroblast growth factor receptor 3
Synonyms:
CD_antigen: CD333 FGFR3 Fibroblast growth factor receptor JTK4
Type:
Protein
Mol. Mass.:
87699.57
Organism:
Homo sapiens (Human)
Description:
P22607
Residue:
806
  
Inhibitor
Name:
BDBM356522
Synonyms:
N-(2-Morpholin-4-ylethyl)-4-{1-[3-({[(2,2,2-trifluoroethyl)amino]carbonyl}amino)phenyl]-1H-benzimidazol-5-yl}benzamide US10813930, Ex. No. 11
Type:
Small organic molecule
Emp. Form.:
C29H29F3N6O3
Mol. Mass.:
566.5742
SMILES:
FC(F)(F)CNC(=O)Nc1cccc(c1)-n1cnc2cc(ccc12)-c1ccc(cc1)C(=O)NCCN1CCOCC1
: