Target
Fibroblast growth factor receptor 3
Ligand
BDBM356531
Substrate
Meas. Tech.
Enzymatic Assay
IC50
<10±n/a nM
Citation
 Yao, WZhang, CXu, MZhuo, JHe, C Substituted imidazopyridazines and benzimidazoles as inhibitors of FGFR3 US Patent  US10813930 Publication Date 10/27/2020 
Target
Name:
Fibroblast growth factor receptor 3
Synonyms:
CD_antigen: CD333 FGFR3 Fibroblast growth factor receptor JTK4
Type:
Protein
Mol. Mass.:
87699.57
Organism:
Homo sapiens (Human)
Description:
P22607
Residue:
806
  
Inhibitor
Name:
BDBM356531
Synonyms:
N-[(1-Methyl-1H-imidazol-2-yl)methyl]-2-(4-{1-[3-({[(2,2,2-trifluoroethyl)amino]carbonyl}amino)phenyl]-1H-benzimidazol-5-yl}phenyl)propanamide US10813930, Ex. No. 20
Type:
Small organic molecule
Emp. Form.:
C30H28F3N7O2
Mol. Mass.:
575.5842
SMILES:
CC(C(=O)NCc1nccn1C)c1ccc(cc1)-c1ccc2n(cnc2c1)-c1cccc(NC(=O)NCC(F)(F)F)c1
: