Target
Fibroblast growth factor receptor 3
Ligand
BDBM356533
Substrate
Meas. Tech.
Enzymatic Assay
IC50
<10±n/a nM
Citation
 Yao, WZhang, CXu, MZhuo, JHe, C Substituted imidazopyridazines and benzimidazoles as inhibitors of FGFR3 US Patent  US10813930 Publication Date 10/27/2020 
Target
Name:
Fibroblast growth factor receptor 3
Synonyms:
CD_antigen: CD333 FGFR3 Fibroblast growth factor receptor JTK4
Type:
Protein
Mol. Mass.:
87699.57
Organism:
Homo sapiens (Human)
Description:
P22607
Residue:
806
  
Inhibitor
Name:
BDBM356533
Synonyms:
N-[3-(5-{1-[1-(Cyanomethyl)-2,2,2-trifluoroethyl]-1H-pyrazol-4-yl}-1H-benzimidazol-1-yl)phenyl]-N′-(2,2,2-trifluoroethyl)urea US10813930, Ex. No. 22
Type:
Small organic molecule
Emp. Form.:
C23H17F6N7O
Mol. Mass.:
521.4178
SMILES:
FC(F)(F)CNC(=O)Nc1cccc(c1)-n1cnc2cc(ccc12)-c1cnn(c1)C(CC#N)C(F)(F)F
: