Target
Fibroblast growth factor receptor 3
Ligand
BDBM356535
Substrate
Meas. Tech.
Enzymatic Assay
IC50
<10±n/a nM
Citation
 Yao, WZhang, CXu, MZhuo, JHe, C Substituted imidazopyridazines and benzimidazoles as inhibitors of FGFR3 US Patent  US10813930 Publication Date 10/27/2020 
Target
Name:
Fibroblast growth factor receptor 3
Synonyms:
CD_antigen: CD333 FGFR3 Fibroblast growth factor receptor JTK4
Type:
Protein
Mol. Mass.:
87699.57
Organism:
Homo sapiens (Human)
Description:
P22607
Residue:
806
  
Inhibitor
Name:
BDBM356535
Synonyms:
N-{3-[5-(1-{1-[(1-Methyl-1H-pyrazol-3-yl)sulfonyl]piperidin-4-yl}-1H-pyrazol-4-yl)-1H-benzimidazol-1-yl]phenyl}-N′-(2,2,2-trifluoroethyl)urea US10813930, Ex. No. 24
Type:
Small organic molecule
Emp. Form.:
C28H28F3N9O3S
Mol. Mass.:
627.641
SMILES:
Cn1ccc(n1)S(=O)(=O)N1CCC(CC1)n1cc(cn1)-c1ccc2n(cnc2c1)-c1cccc(NC(=O)NCC(F)(F)F)c1
: