Target
Fibroblast growth factor receptor 3
Ligand
BDBM356558
Substrate
Meas. Tech.
Enzymatic Assay
IC50
<10±n/a nM
Citation
 Yao, WZhang, CXu, MZhuo, JHe, C Substituted imidazopyridazines and benzimidazoles as inhibitors of FGFR3 US Patent  US10813930 Publication Date 10/27/2020 
Target
Name:
Fibroblast growth factor receptor 3
Synonyms:
CD_antigen: CD333 FGFR3 Fibroblast growth factor receptor JTK4
Type:
Protein
Mol. Mass.:
87699.57
Organism:
Homo sapiens (Human)
Description:
P22607
Residue:
806
  
Inhibitor
Name:
BDBM356558
Synonyms:
N-{3-[7-(1-{1-[(3-hydroxycyclobutyl)carbonyl]piperidin-4-yl}-1H-pyrazol-4-yl)imidazo[1,2-b]pyridazin-3-yl]phenyl}-N′-(2,2,2-trifluoroethyl)urea US10813930, Ex. No. 47
Type:
Small organic molecule
Emp. Form.:
C28H29F3N8O3
Mol. Mass.:
582.5769
SMILES:
OC1CC(C1)C(=O)N1CCC(CC1)n1cc(cn1)-c1cnn2c(cnc2c1)-c1cccc(NC(=O)NCC(F)(F)F)c1
: