Target
Fibroblast growth factor receptor 3
Ligand
BDBM470285
Substrate
Meas. Tech.
Enzymatic Assay
IC50
<10±n/a nM
Citation
 Yao, WZhang, CXu, MZhuo, JHe, C Substituted imidazopyridazines and benzimidazoles as inhibitors of FGFR3 US Patent  US10813930 Publication Date 10/27/2020 
Target
Name:
Fibroblast growth factor receptor 3
Synonyms:
CD_antigen: CD333 FGFR3 Fibroblast growth factor receptor JTK4
Type:
Protein
Mol. Mass.:
87699.57
Organism:
Homo sapiens (Human)
Description:
P22607
Residue:
806
  
Inhibitor
Name:
BDBM470285
Synonyms:
N-(2-Hydroxypropyl)-2-(4-{3-[3-({[(2,2,2-trifluoroethyl)amino]carbonyl}amino)phenyl]imidazo[1,2-b]pyridazin-7-yl}-1H-pyrazol-1-yl)propanamide | US10813930, Ex. No. 63
Type:
Small organic molecule
Emp. Form.:
C24H25F3N8O3
Mol. Mass.:
530.5023
SMILES:
CC(O)CNC(=O)C(C)n1cc(cn1)-c1cnn2c(cnc2c1)-c1cccc(NC(=O)NCC(F)(F)F)c1
: