Target
Fibroblast growth factor receptor 3
Ligand
BDBM470303
Substrate
Meas. Tech.
Enzymatic Assay
IC50
<10±n/a nM
Citation
 Yao, WZhang, CXu, MZhuo, JHe, C Substituted imidazopyridazines and benzimidazoles as inhibitors of FGFR3 US Patent  US10813930 Publication Date 10/27/2020 
Target
Name:
Fibroblast growth factor receptor 3
Synonyms:
CD_antigen: CD333 FGFR3 Fibroblast growth factor receptor JTK4
Type:
Protein
Mol. Mass.:
87699.57
Organism:
Homo sapiens (Human)
Description:
P22607
Residue:
806
  
Inhibitor
Name:
BDBM470303
Synonyms:
N-[3-(7-{1-[3-(Cyanomethyl)-1-(tetrahydrofuran-2-ylacetyl)azetidin-3-yl]-1H-pyrazol-4-yl}imidazo[1,2-b]pyridazin-3-yl)phenyl]-N′-(2,2,2-trifluoroethyl)urea | US10813930, Ex. No. 81
Type:
Small organic molecule
Emp. Form.:
C29H28F3N9O3
Mol. Mass.:
607.5863
SMILES:
FC(F)(F)CNC(=O)Nc1cccc(c1)-c1cnc2cc(cnn12)-c1cnn(c1)C1(CC#N)CN(C1)C(=O)CC1CCCO1
: