Target
Fibroblast growth factor receptor 3
Ligand
BDBM356604
Substrate
Meas. Tech.
Enzymatic Assay
IC50
<10±n/a nM
Citation
 Yao, WZhang, CXu, MZhuo, JHe, C Substituted imidazopyridazines and benzimidazoles as inhibitors of FGFR3 US Patent  US10813930 Publication Date 10/27/2020 
Target
Name:
Fibroblast growth factor receptor 3
Synonyms:
CD_antigen: CD333 FGFR3 Fibroblast growth factor receptor JTK4
Type:
Protein
Mol. Mass.:
87699.57
Organism:
Homo sapiens (Human)
Description:
P22607
Residue:
806
  
Inhibitor
Name:
BDBM356604
Synonyms:
N-(3-{7-[1-(2-Cyano-1-phenylethyl)-1H-pyrazol-4-yl]imidazo[1,2-b]pyridazin-3-yl}phenyl)-N′-(2,2,2-trifluoroethyl)urea US10813930, Ex. No. 93
Type:
Small organic molecule
Emp. Form.:
C27H21F3N8O
Mol. Mass.:
530.5038
SMILES:
FC(F)(F)CNC(=O)Nc1cccc(c1)-c1cnc2cc(cnn12)-c1cnn(c1)C(CC#N)c1ccccc1
: