Target
Fibroblast growth factor receptor 3
Ligand
BDBM356606
Substrate
Meas. Tech.
Enzymatic Assay
IC50
17.5±n/a nM
Citation
 Yao, WZhang, CXu, MZhuo, JHe, C Substituted imidazopyridazines and benzimidazoles as inhibitors of FGFR3 US Patent  US10813930 Publication Date 10/27/2020 
Target
Name:
Fibroblast growth factor receptor 3
Synonyms:
CD_antigen: CD333 FGFR3 Fibroblast growth factor receptor JTK4
Type:
Protein
Mol. Mass.:
87699.57
Organism:
Homo sapiens (Human)
Description:
P22607
Residue:
806
  
Inhibitor
Name:
BDBM356606
Synonyms:
US10213427, Example 95 cis-N-{[(2-Hydroxycyclohexyl]methyl}-3-{3-[3-({[(2,2,2-trifluoroethyl)amino]carbonyl}amino)phenyl]imidazo[1,2-b]pyridazin-7-yl}benzamide
Type:
Small organic molecule
Emp. Form.:
C29H29F3N6O3
Mol. Mass.:
566.5742
SMILES:
O[C@H]1CCCC[C@H]1CNC(=O)c1cccc(c1)-c1cnn2c(cnc2c1)-c1cccc(NC(=O)NCC(F)(F)F)c1
: