Target
Glycogen synthase kinase-3 alpha
Ligand
BDBM330261
Substrate
Meas. Tech.
Enzyme Inhibition
IC50
2494±n/a nM
Citation
 Ito, KCharron, CEKing-Underwood, JOnions, STLongshaw, AI 1-pyrazolyl-3-(4-((2-anilinopyrimidin-4-yl) oxy) napththalen-1-yl) ureas as P38 MAP knase inhibitors US Patent  US10813932 Publication Date 10/27/2020 
Target
Name:
Glycogen synthase kinase-3 alpha
Synonyms:
GSK-3 alpha GSK3A_HUMAN Glycogen synthase kinase-3 Glycogen synthase kinase-3 alpha (GSK3 Alpha) Glycogen synthase kinase-3 alpha (GSK3alpha)
Type:
Enzyme
Mol. Mass.:
50991.79
Organism:
Homo sapiens (Human)
Description:
P49840
Residue:
483
  
Inhibitor
Name:
BDBM330261
Synonyms:
1-(3-(tert-butyl)-1-(4-hydroxyphenyl)-1H-pyrazol-5-yl)-3-(4-((2-(phenylamino)pyrimidin-4-yl)oxy)naphthalen-1-yl)urea BDBM397488 US9724347, Example 3
Type:
Small organic molecule
Emp. Form.:
C34H31N7O3
Mol. Mass.:
585.655
SMILES:
CC(C)(C)c1cc(NC(=O)Nc2ccc(Oc3ccnc(Nc4ccccc4)n3)c3ccccc23)n(n1)-c1ccc(O)cc1
: