Target
Glycogen synthase kinase-3 alpha
Ligand
BDBM330263
Substrate
Meas. Tech.
Enzyme Inhibition
IC50
>16300±n/a nM
Citation
 Ito, KCharron, CEKing-Underwood, JOnions, STLongshaw, AI 1-pyrazolyl-3-(4-((2-anilinopyrimidin-4-yl) oxy) napththalen-1-yl) ureas as P38 MAP knase inhibitors US Patent  US10813932 Publication Date 10/27/2020 
Target
Name:
Glycogen synthase kinase-3 alpha
Synonyms:
GSK-3 alpha GSK3A_HUMAN Glycogen synthase kinase-3 Glycogen synthase kinase-3 alpha (GSK3 Alpha) Glycogen synthase kinase-3 alpha (GSK3alpha)
Type:
Enzyme
Mol. Mass.:
50991.79
Organism:
Homo sapiens (Human)
Description:
P49840
Residue:
483
  
Inhibitor
Name:
BDBM330263
Synonyms:
1-(3-(tert-butyl)-1-(p-tolyl)-1H-pyrazol-5-yl)- 3-(4-((2-((2-methoxyphenyl)amino) pyrimidin-4-yl)oxy)naphthalen-1-yl)urea US10813932, Example 5 US9993478, Example 5
Type:
Small organic molecule
Emp. Form.:
C36H35N7O3
Mol. Mass.:
613.7082
SMILES:
COc1ccccc1Nc1nccc(Oc2ccc(NC(=O)Nc3cc(nn3-c3ccc(C)cc3)C(C)(C)C)c3ccccc23)n1
: