Target
Mitogen-activated protein kinase 14
Ligand
BDBM330284
Substrate
Meas. Tech.
Enzyme Inhibition
IC50
549±n/a nM
Citation
 Ito, KCharron, CEKing-Underwood, JOnions, STLongshaw, AI 1-pyrazolyl-3-(4-((2-anilinopyrimidin-4-yl) oxy) napththalen-1-yl) ureas as P38 MAP knase inhibitors US Patent  US10813932 Publication Date 10/27/2020 
Target
Name:
Mitogen-activated protein kinase 14
Synonyms:
CSAID-binding protein CSBP1 CSPB1 MAP kinase 14 MAP kinase p38 alpha MAPK14 MK14_HUMAN Mitogen-activated protein kinase p38 alpha Stress-activated protein kinase 2a | p38 MAP kinase alpha/beta
Type:
Serine/threonine-protein kinase
Mol. Mass.:
41286.76
Organism:
Homo sapiens (Human)
Description:
Q16539
Residue:
360
  
Inhibitor
Name:
BDBM330284
Synonyms:
1-(3-(tert-butyl)-1-(p-tolyl)-1H-pyrazol-5-yl)- 3-(4-((2-((3-hydroxy-4-methylphenyl) amino)pyrimidin-4-yl)oxy)naphthalen-1- yl)urea US10813932, Example 26 US9993478, Example 26
Type:
Small organic molecule
Emp. Form.:
C36H35N7O3
Mol. Mass.:
613.7082
SMILES:
Cc1ccc(cc1)-n1nc(cc1NC(=O)Nc1ccc(Oc2ccnc(Nc3ccc(C)c(O)c3)n2)c2ccccc12)C(C)(C)C
: