Target
Asialoglycoprotein receptor 1
Ligand
BDBM408861
Substrate
Meas. Tech.
SPR binding assay
Kd
6500±n/a nM
Citation
 Liras, SMascitti, VThuma, B Substituted-6,8-dioxabicyclo[3.2.1]octane-2,3-diol compounds as targeting agents of ASGPR US Patent  US10813942 Publication Date 10/27/2020 
Target
Name:
Asialoglycoprotein receptor 1
Synonyms:
ASGP-R 1 ASGR1 CLEC4H1 | Hepatic lectin H1
Type:
PROTEIN
Mol. Mass.:
33177.60
Organism:
Homo sapiens (Human)
Description:
ChEMBL_603824
Residue:
291
  
Inhibitor
Name:
BDBM408861
Synonyms:
US10376531, Compound 22 | US10813942, Compound 22
Type:
Small organic molecule
Emp. Form.:
C18H33NO10
Mol. Mass.:
423.4553
SMILES:
COCCOCCOCCOCCOC[C@@]12CO[C@@H](O1)[C@H](NC(C)=O)[C@@H](O)[C@H]2O
: