Target
Receptor-interacting serine/threonine-protein kinase 1
Ligand
BDBM464513
Substrate
Meas. Tech.
Biochemical Assay
IC50
19.0±n/a nM
Citation
 Masuda, EShaw, STaylor, VBhamidipati, S RIP1 inhibitory compounds and methods for making and using the same US Patent  US10815206 Publication Date 10/27/2020 
Target
Name:
Receptor-interacting serine/threonine-protein kinase 1
Synonyms:
Cell death protein RIP RIP-1 RIPK1 Receptor-interacting protein 1
Type:
Enzyme Catalytic Domain
Mol. Mass.:
75926.99
Organism:
Homo sapiens (Human)
Description:
Q13546
Residue:
671
  
Inhibitor
Name:
BDBM464513
Synonyms:
US10815206, Compound I-1
Type:
Small organic molecule
Emp. Form.:
C25H27N5O5
Mol. Mass.:
477.5124
SMILES:
COCC(=O)CCc1ccc2OC[C@H](NC(=O)c3n[nH]c(Cc4ccccc4)n3)C(=O)N(C)c2c1
: